aatteet
type: Concept
preferred label: ideer @sv
preferred label: ideas @en
narrower: illusionismi (aatteet)

illusionismi (aatteet)
type: Concept
broader: aatteet
source: Kielitoimiston sanakirja
comment: fil. näkemys, jonka mukaan todellisuus on kuvittelua, illuusiota
alternative label: illusionismi
in scheme: conceptscheme
preferred label: illusionism (ideas) @en