descriptions
type: Concept
preferred label: kuvaukset @fi
narrower: description of nature

description of milieu
type: Concept
preferred label: miljöökuvaus @fi
preferred label: miljöbeskrivning @sv
related: description of nature

description of nature
type: Concept
in scheme: conceptscheme
scope note: Används i samband med litteratur @sv
scope note: Käytetään kirjallisuuden yhteydessä. Valokuvauksen yhteydessä käytä luonnonvalokuvaus
preferred label: luonnonkuvaus @fi
preferred label: naturbeskrivning @sv
related: description of milieu
broader: descriptions