sodat
type: Concept
preferred label: wars @en
preferred label: krig @sv
narrower: Turkin sota

Turkin sota
type: Concept
broader: sodat
scope note: Tarkoittaa Venäjän ja Turkin välistä sotaa 1877-78
in scheme: conceptscheme
preferred label: rysk-turkiska kriget (1877.-1878) @sv
preferred label: Russo-Turkish War (1877?1878) @en