muut ilmiöt
type: Concept
preferred label: other phenomena @en
narrower: diffuusio

diffuusio
type: Concept
broader: muut ilmiöt
in scheme: conceptscheme
source: Suomen kielen perussanakirja
comment: 1) (kem., fys.) lämpöliikkeestä johtuva ainehiukkasten sekoittuminen toisiinsa; 2) (sosiol.) kulttuuripiirteiden siirtyminen ryhmältä toiselle
preferred label: diffusion @sv