lykkäys
type: Concept
preferred label: uppskjutande @sv
preferred label: deferment @en
comment: jnk toimenpiteen, asian käsittelyn tms. lykkääminen, siirtäminen tuonnemmaksi; määräajan pidennys
source: Kielitoimiston sanakirja
in scheme: conceptscheme
broader: lopettava muuttaminen

lopettava muuttaminen
type: Concept
preferred label: change by finishing @en
preferred label: avbrytande förändring @sv
narrower: lykkäys