work
type: Concept
preferred label: arbete @sv
preferred label: työ @fi
narrower: labour service

labour service
type: Concept
broader: work
in scheme: conceptscheme
preferred label: työpalvelu @fi
preferred label: arbetstjänst @sv
comment: määrätyötä varten koottujen ryhmien pakollisesta t. vapaaehtoisesta työstä
source: Kielitoimiston sanakirja