Ainola
type: Concept
broader: artists' homes
scope note: Säveltäjä Jean Sibeliuksen taiteilijakoti Järvenpäässä. Valtio osti Ainolan v. 1972, ja se avattiin museona v. 1974
in scheme: conceptscheme

artists' homes
type: Concept
preferred label: konstnärshem @sv
preferred label: taiteilijakodit @fi
narrower: Ainola