kouluneuvokset
type: Concept
broader: titles
scope note: In singular, 'kouluneuvos', in plural 'kouluneuvokset'.
in scheme: conceptscheme

titles
type: Concept
preferred label: titlar @sv
preferred label: arvonimet @fi
narrower: kouluneuvokset