RAVA-mittari
type: Concept
broader: mitat (mittaustapa)
comment: (vanhusten) toimintakyvyn ja avuntarpeen mittari, jolla arvioidaan mm. aistitoimintoja, liikkumista, syömistä, pukeutumista ja hygienian hoitoa
alternative label: RAVA-indeksi
in scheme: conceptscheme

mitat (mittaustapa)
type: Concept
preferred label: measures @en
preferred label: mått @sv
narrower: RAVA-mittari