husdjursskötsel
type: Concept
preferred label: domestic animal farming. @en
preferred label: kotieläintalous @fi
narrower: pälsdjursuppfödning

pälsdjursuppfödning
type: Concept
in scheme: conceptscheme
preferred label: fur business @en
preferred label: turkistalous @fi
scope note: turkistalous + turkistarhaus = pälsdjursuppfödning
broader: husdjursskötsel
alternative label: pälsdjursskötsel