matter
type: Concept
preferred label: aine @fi
preferred label: materia @sv
narrower: tar

tar
type: Concept
comment: puun, kivihiilen tms. kuivatislauksessa syntyvä voimakkaan hajuinen, tav. sakea tumma neste
preferred label: terva @fi
preferred label: tjära @sv
source: Kielitoimiston sanakirja
broader: matter
in scheme: conceptscheme