positionsbestämning
type: Concept
preferred label: locationing @en
preferred label: paikannus @fi
narrower: satellitnavigering

satellitnavigering
type: Concept
preferred label: satellite radiodetermination @en
preferred label: satelliittipaikannus @fi
alternative label: GPS
in scheme: conceptscheme
broader: positionsbestämning
comment: satelliittien lähettämiin radiosignaaleihin perustuva paikannus
source: Paikannussanasto TSK 30