miljöförvaltning
type: Concept
preferred label: environment administration @en
preferred label: ympäristöhallinto @fi
narrower: vattenförvaltning

vattenförvaltning
type: Concept
in scheme: conceptscheme
preferred label: vesihallinto @fi
preferred label: water administration @en
scope note: Termen användes åren 1970-1986 därefter togs termen vatten- och miljöförvaltning i bruk.
scope note: Nimitys käytössä v. 1970-1986. Vesihallinto muuttuui vuonna 1986 vesi- ja ympäristöhallinnoksi, jolloin vesihallitus lakkautettiin ja perustettiin vesi- ja ympäristöhallitus
related: vatten- och miljöförvaltning
broader: miljöförvaltning

vatten- och miljöförvaltning
type: Concept
preferred label: water and environmental administration @en
preferred label: vesi- ja ympäristöhallinto @fi
related: vattenförvaltning