tekstijulkaisut
type: Concept
preferred label: textutgåvor @sv
preferred label: text publications @en
in scheme: conceptscheme
broader: julkaisut
source: Lähde: Suomen kielen perussanakirja
scope note: Tarkoittaa historiallisesti ja kielitieteellisesti arvokkaita tekstejä sisältäviä julkaisuja

julkaisut
type: Concept
preferred label: publikationer @sv
preferred label: publications @en
narrower: tekstijulkaisut