garinagu
type: Concept
broader: role related to population group
scope note: In singular 'garifuna', in plural 'garinagu'.
scope note: Garifunat ovat Karibian alueelle siirtomaa-ajalla kuljetettujen afrikkalaisten orjien ja paikallisten alkuperäisasukkaiden jälkeläisiä
in scheme: conceptscheme
preferred label: garífuna @sv
preferred label: garifunat @fi

role related to population group
type: Concept
preferred label: väestöryhmään liittyvä rooli @fi
preferred label: roll i anslutning till befolkningsgrupp @sv
narrower: garinagu