muu rooli
type: Concept
preferred label: annan roll @sv
preferred label: other role @en
narrower: paras käytettävissä oleva tekniikka

ympäristöteknologia
type: Concept
preferred label: miljöteknologi @sv
preferred label: environmental technology @en
related: paras käytettävissä oleva tekniikka

paras käytettävissä oleva tekniikka
type: Concept
scope note: Tarkoittaa ympäristötekniikkaa, joka ottaa huomioon teknisesti ja taloudellisesti mahdollisimman tehokkaat ja kehittyneet ratkaisut
preferred label: bästa tillgängliga teknik @sv
preferred label: best available technology @en
alternative label: paras käyttökelpoinen tekniikka
broader: muu rooli
in scheme: conceptscheme
related: ympäristöteknologia