pääomanliikkeet
type: Concept
broader: taloudelliset ilmiöt
alternative label: pääomaliikkeet
preferred label: kapitalrörelser @sv
preferred label: capital movements @en
scope note: Ulkomaisten saatavien ja velkojen muutokset
in scheme: conceptscheme

taloudelliset ilmiöt
type: Concept
preferred label: economic phenomena @en
narrower: pääomanliikkeet