företagsekonomi
type: Concept
in scheme: conceptscheme
comment: yritystoiminnalla ansion muodostukseen tähtäävä talous(toiminta), yritystalous [Kielitoimiston sanakirja]
alternative label: affärsekonomi
alternative label: yritystalous @fi
broader: ekonomi
preferred label: business economy @en
preferred label: liiketalous @fi
source: Kielitoimiston sanakirja

ekonomi
type: Concept
preferred label: economy @en
preferred label: talous (taloudelliset ilmiöt) @fi
narrower: företagsekonomi