tekniset järjestelmät
type: Concept
preferred label: technical systems @en
narrower: CGI

CGI
type: Concept
broader: tekniset järjestelmät
scope note: CGI on standardi, joka määrittelee miten palvelimen ja oh- jelman välinen kommunikointi tapahtuu; se on rajapinta, joka määrittelee miten WWW-lomakkeeelle kirjoitetut tiedot välitetään niitä käsittelevälle ohjelmalle
alternative label: Common Gateway Interface
in scheme: conceptscheme