karaiimit
type: Concept
alternative label: karailaiset
alternative label: karaiitit
alternative label: karealaiset
preferred label: karaimer @sv
preferred label: Karaites @en
scope note: Juutalaisuudesta irronnut lahko, jonka 700-luvulla perusti Anan ben David; etnisenä ryhmänä Liettuassa, Ukrainassa ja Krimillä
broader: uskonnolliset yhteisöt
in scheme: conceptscheme

uskonnolliset yhteisöt
type: Concept
preferred label: religious communities @en
preferred label: religiösa samfund @sv
narrower: karaiimit