tipsande
type: Concept
preferred label: vinkkaus @fi
narrower: bokprat

bokprat
type: Concept
broader: tipsande
comment: Kirjavinkkaus on lukemaanhoukutusmenetelmä, jossa kirjaston työntekijä, opettaja tai muu kirjallisuudesta innostunut ihminen kertoo ryhmälle valitsemistaan kirjoista.
in scheme: conceptscheme
preferred label: book hints @en
preferred label: kirjavinkkaus @fi