förlikning
type: Concept
preferred label: sovittelu @fi
preferred label: arbitration @en
broader: ömsesidig aktivitet
related: restorative justice
related: alternativ tvistlösning
related: samhällstjänst
in scheme: conceptscheme
scope note: Inom civilrätten innebär förlikning ett avgörande av en tvist i godo utan rättslig prövning. Flertalet tvister löses på detta sätt, antingen av parterna själva eller med hjälp av personal från socialväsendet.
scope note: sovittelu + sovinto = förlikning
scope note: Sovittelu rikosoikeudessa tarkoittaa sitä, että syyllinen sovittaa rikoksesta saamansa tuomion osapuolten sopimalla tavalla. Sovittelutoimintaa ei ole Suomessa järjestetty lainsäädännöllisin toimenpitein, vaan useimmiten se on organisoitu kuntien sosiaalitoimen yhteyteen
source: Lähde: Encyclopaedia iuridica Fennica

ömsesidig aktivitet
type: Concept
preferred label: mutual activity @en
preferred label: keskinäinen toiminta @fi
narrower: förlikning

restorative justice
type: Concept
preferred label: restoratiivinen oikeus @fi
related: förlikning

alternativ tvistlösning
type: Concept
preferred label: alternative dispute resolution @en
preferred label: vaihtoehtoinen riidanratkaisu @fi
related: förlikning

samhällstjänst
type: Concept
preferred label: community service @en
preferred label: yhdyskuntapalvelu @fi
related: förlikning