art connoisseurship
type: Concept
broader: cultural phenomena
scope note: Tarkoittaa mm. tutkimussuuntaa, joka painottuu tekijän tunnistamiseen, hänen tuotantonsa selvittämiseen ja teosten ajoittamiseen
in scheme: conceptscheme
preferred label: taiteentuntemus @fi
preferred label: konstkännedom @sv

cultural phenomena
type: Concept
preferred label: kulttuuriset ilmiöt @fi
narrower: art connoisseurship