prosessitaide
type: Concept
preferred label: processkonst @sv
preferred label: process art @en
in scheme: conceptscheme
scope note: 1960-luvulla syntynyt taidesuunta, jonka mukaan luomisprosessi on tärkeämpi kuin sen tuote, taideteos. Prosessitaiteilijat käyttävät usein materiaaleinaan muuttuvia luonnonelementtejä ja järjestävät tilaisuuksia, joissa taideteos valmistetaan
scope note: Konstinriktning som uppstod på 1960-talet och som framhäver den skapande processen framom det färdiga konstverket. Konstnärerna använder sig ofta av föränderliga naturelement och arrangerar tillställningar där själva konstverket skapas. @sv
source: Lähde: Taiteen pikkujättiläinen
broader: taidelajit

taidelajit
type: Concept
preferred label: art forms @en
narrower: prosessitaide