clearing system
type: Concept
comment: rahalaitosten keskinäisselvitys, jolla tasataan pankkien väliset velat ja saatavat
preferred label: clearing @fi
source: Suomen kielen perussanakirja
in scheme: conceptscheme
broader: transfer of money

transfer of money
type: Concept
preferred label: penningöverföring @sv
preferred label: rahavarojen siirtäminen @fi
narrower: clearing system