televisio-ohjelmat
type: Concept
preferred label: TV programmes @en
preferred label: TV-program @sv
narrower: tosi-tv

tosi-tv
type: Concept
broader: televisio-ohjelmat
preferred label: realitets-TV @sv
preferred label: reality tv @en
alternative label: verklighets-TV @sv
alternative label: todellisuustelevisio
alternative label: todellisuus-tv
in scheme: conceptscheme
scope note: Tarkoittaa televisio-ohjelmaa, jossa kuvataan tavallisia ihmisiä jossakin todellisessa tilanteessa