native breeds
type: Concept
preferred label: lantraser @sv
preferred label: maatiaisrodut @fi
in scheme: conceptscheme
related: animals
alternative label: local breeds
comment: Maatiaisrotu tarkoittaa tietyn eläinlajin joukkoa, joka on elänyt samalla alueella satojen vuosien ajan ja jolle on siten kehittynyt muualla elävistä lajin edustajista poikkeavia ominaisuuksia käyttäytymiseen ja ulkomuotoon.
broader: races

animals
type: Concept
preferred label: eläimet @fi
preferred label: djur @sv
related: native breeds

races
type: Concept
preferred label: rodut (rooli) @fi
preferred label: raser @sv
narrower: native breeds