international examinations
type: Concept
preferred label: internationella examina @sv
preferred label: kansainväliset tutkinnot @fi
narrower: Advanced International Certificate of Education

Advanced International Certificate of Education
type: Concept
broader: international examinations
source: Lähde: Advanced international certificate of education (AICE) -tutkintoa selvittäneen työryhmän muistio
scope note: Advanced International Certificate of Education (AICE) -tutkinto on Cambridgen yliopiston kansainvälinen yliopisto-opintoja edeltävä tutkinto, joka perustuu kaksivuotiseen opetusohjelmaan
alternative label: AICE @fi
in scheme: conceptscheme