styles
type: Concept
preferred label: tyylit @fi
preferred label: stilar @sv
narrower: verism

verism
type: Concept
broader: styles
source: MOT Gummerus Uusi suomen kielen sanakirja 1.0a
comment: Italian kirjallisuudessa, musiikissa ja kuvataiteessa Ranskan naturalismin vaikutuksesta 1800-luvun puolivälissä syntynyt suuntaus, joka pyrki kuvaamaan todellisuutta kaunistelemattoman naturalistisesti
in scheme: conceptscheme
preferred label: verismi @fi