Siberian Ginseng
type: Concept
broader: araliaceae
scope note: Murattikasveihin kuuluvasta Acanthopanax senticosus -pensaasta saatava juuri, jota käytetään lääkkeenä
in scheme: conceptscheme
preferred label: venäjänjuuri @fi
preferred label: rysk rot @sv

araliaceae
type: Concept
preferred label: murattikasvit @fi
preferred label: araliaväxter @sv
narrower: Siberian Ginseng