laminat
type: Concept
comment: pinnoite, joka on valmistettu erillisessä prosessissa liittämällä yhteen vähintään kaksi erillistä kalvoa Kalvoihin on imeytetty lämpökovetteista hartsia tai hartsiseosta.Laminaatin pintakerroksena on yleensä mekaanista kulutusta ja kemiallista rasitusta kestävä kerros.
in scheme: conceptscheme
broader: ytbeläggningar
preferred label: laminate @en
preferred label: laminaatti @fi
source: SFS 2457 Puukalusteet. Laatuvaatimukset Kitchen furniture. Quality requirements

ytbeläggningar
type: Concept
preferred label: pinnoitteet @fi
preferred label: coatings @en
narrower: laminat