samhälleliga system
type: Concept
preferred label: societal systems @en
preferred label: yhteiskunnalliset järjestelmät @fi
narrower: omplaceringsskydd

omplaceringsskydd
type: Concept
related: sysselsättning (åtgärder)
preferred label: muutosturva @fi
preferred label: transition assistance @en
broader: samhälleliga system
in scheme: conceptscheme
scope note: En person som blir uppsagd ska få stöd och hjälp av arbetsgivaren att hitta ett nytt arbete.

sysselsättning (åtgärder)
type: Concept
preferred label: integration into working life @en
preferred label: työllistäminen @fi
related: omplaceringsskydd