fostran
type: Concept
preferred label: upbringing @en
preferred label: kasvatus (ihmisen) @fi
narrower: folkupplysning

fritt bildningsarbete
type: Concept
preferred label: free adult education @en
preferred label: vapaa sivistystyö @fi
related: folkupplysning

folkupplysning
type: Concept
scope note: Termen används enbart i historisk betydelse. I andra sammanhang använder man termen fritt bildningsarbete
alternative label: kansansivistystyö @fi
preferred label: popular education @en
preferred label: kansanvalistus @fi
related: fritt bildningsarbete
in scheme: conceptscheme
broader: fostran