geokätköily
type: Concept
preferred label: geocaching @en
alternative label: geokätkentä
broader: liikkuminen
in scheme: conceptscheme
scope note: Modern och världsomspännande variant av skattjakt utomhus, där man dock inte har någon karta. Utövaren söker med hjälp av en GPS-mottagare. @sv

liikkuminen
type: Concept
preferred label: motion (rörelse) @sv
preferred label: bodily exercise @en
narrower: geokätköily