anglonormandiska
type: Concept
scope note: Variant av den normandiska dialekten av franska som talades och skrevs av normanderna i England under århundradena efter erövringen 1066.
preferred label: anglonormanni @fi
preferred label: Anglo-Norman @en
broader: franska
related: dialekter
in scheme: conceptscheme

franska
type: Concept
preferred label: french @en
preferred label: ranskan kieli @fi
narrower: anglonormandiska

dialekter
type: Concept
preferred label: dialects @en
preferred label: murteet @fi
related: anglonormandiska