motorfordon
type: Concept
preferred label: motor vehicles @en
preferred label: moottoriajoneuvot @fi
narrower: motorredskap

arbetsmaskiner
type: Concept
preferred label: working machines @en
preferred label: työkoneet @fi
narrower: motorredskap

motorredskap
type: Concept
in scheme: conceptscheme
broader: arbetsmaskiner
broader: motorfordon
source: AKE
preferred label: moottorityökoneet @fi
preferred label: engine-driven machines @en
comment: työkoneeksi rakennettu ajoneuvo. Moottorityökoneita ovat esimerkiksi kauhakuormaimet, puominosturit ja lakaisukoneet.