glykeeminen kuorma
type: Concept
related: glykeeminen indeksi
alternative label: glykemiakuorma
alternative label: glykemia-annos
scope note: Glykemisk belastning är ett sätt att korrigera det faktum att olika livsmedel ger olika mängd kolhydrat per normal portion. Med denna metod kan den faktiska blodsockerbelastningen vid normal konsumtion av den aktuella produkten uppskattas. @sv
broader: biologiset ilmiöt
preferred label: glycemic load @en
preferred label: glykemisk belastning @sv
in scheme: conceptscheme

glykeeminen indeksi
type: Concept
preferred label: glycemic index @en
preferred label: glykemiskt index @sv
related: glykeeminen kuorma

biologiset ilmiöt
type: Concept
preferred label: biological phenomena @en
narrower: glykeeminen kuorma