organisations (systems)
type: Concept
preferred label: organisaatiot @fi
preferred label: organisationer @sv
narrower: student unions

student unions
type: Concept
in scheme: conceptscheme
related: student organisations
broader: organisations (systems)
preferred label: ylioppilaskunnat @fi
preferred label: studentkårer @sv
source: Kielitoimiston sanakirja
comment: korkeakoulun opiskelijoiden julkisoikeudellinen yhteisö, jonka jäseneksi tulevat automaattisesti kaikki korkeakouluun läsnäoleviksi kirjoittautuneet

student organisations
type: Concept
preferred label: studentorganisationer @sv
preferred label: opiskelijajärjestöt @fi
related: student unions