galls
type: Concept
broader: biological phenomena
source: Kielitoimiston sanakirja
comment: vars. loiseliöiden aiheuttamia kasvien pieniä kasvannaisia
in scheme: conceptscheme
preferred label: gallbildning @sv
preferred label: äkämät @fi

biological phenomena
type: Concept
preferred label: biologiset ilmiöt @fi
narrower: galls