external properties
type: Concept
preferred label: yttre egenskaper @sv
preferred label: ulkoiset ominaisuudet @fi
narrower: substitutability

substitutability
type: Concept
preferred label: ersättbarhet @sv
preferred label: korvaavuus @fi
alternative label: replacement
broader: external properties
scope note: utbytbarhet + ersättbarhet = korvaavuus @sv
in scheme: conceptscheme