Långforsens naturskyddsområde
type: Concept
broader: naturskyddsområden
scope note: Naturskyddsområde för lundarna på Långforsens sluttningar på gränsen mellan Helsingfors och Vanda
in scheme: conceptscheme
preferred label: Pitkäkosken luonnonsuojelualue @fi

naturskyddsområden
type: Concept
preferred label: nature reserves @en
preferred label: luonnonsuojelualueet @fi
narrower: Långforsens naturskyddsområde