kuori (konkreettinen eloton objekti)
type: Concept
preferred label: shell (concrete inanimate object) @en
preferred label: bark @sv
comment: ohuehko suojaava (t. koossa pitävä) päällys
broader: konkreettinen eloton objekti
source: Kielitoimiston sanakirja
alternative label: kuori
in scheme: conceptscheme

konkreettinen eloton objekti
type: Concept
preferred label: concrete inanimate object @en
preferred label: konkret icke-levande objekt @sv
narrower: kuori (konkreettinen eloton objekti)