substraatti (kielelliset ilmiöt)
type: Concept
broader: kielelliset ilmiöt
source: YSA
comment: sana tai kieliopillinen muoto, joka on säilynyt valloittajan, siirtolaisten tai uudisasukkaiden maahan tuomassa valtakielessä jäänteenä siellä aiemmin puhutusta
alternative label: substraatti
in scheme: conceptscheme
preferred label: substrat @sv

kielelliset ilmiöt
type: Concept
preferred label: linguistic phenomena @en
narrower: substraatti (kielelliset ilmiöt)