tutkimustoiminta
type: Concept
preferred label: forskningsverksamhet @sv
preferred label: research activity @en
narrower: enologia

enologia
type: Concept
in scheme: conceptscheme
preferred label: oenologi @sv
preferred label: oenology @en
broader: tutkimustoiminta
scope note: Oenologi (œnologi, även enologi och önologi), är läran om vin och dess tillverkning @sv
alternative label: viinioppi
alternative label: viinitutkimus