trafikmedicin
type: Concept
broader: medicin
scope note: Med trafikmedicin menas medicinska aspekter på människan i trafiken.
in scheme: conceptscheme
preferred label: traffic medicine @en
preferred label: liikennelääketiede @fi

medicin
type: Concept
preferred label: medicine @en
preferred label: lääketiede @fi
narrower: trafikmedicin