verkkosyötteet
type: Concept
preferred label: webbflöde @sv
preferred label: web feeds @en
narrower: RSS-syötteet
in scheme: conceptscheme
alternative label: sisältösyötteet
source: Tietotekniikan termitalkoot
broader: tekniset tuotokset
comment: XML-kielen mukainen WWW:n sisällön kooste, joka tarjoaa WWW-sivun sisällön vaihtoehtoisessa esitysmuodossa ja usein linkin kyseiselle WWW-sivulle

RSS-syötteet
type: Concept
preferred label: RSS-flöde @sv
preferred label: RSS feeds @en
broader: verkkosyötteet

tekniset tuotokset
type: Concept
preferred label: technical accomplishments @en
narrower: verkkosyötteet