economy
type: Concept
preferred label: talous (taloudelliset ilmiöt) @fi
preferred label: ekonomi @sv
narrower: monetary economy

monetary economy
type: Concept
preferred label: penninghushållning @sv
preferred label: rahatalous @fi
broader: economy
scope note: Tarkoittaa sekä talousjärjestelmää, jossa käytetään rahaa vaihdon välineenä että raha-asioiden hoitoa
source: Lähde: Suomen kielen perussanakirja
in scheme: conceptscheme