liikuttaminen
type: Concept
preferred label: causing to move @en
preferred label: rörelseframkallande @sv
narrower: purkaminen (liikuttaminen)

purkaminen (liikuttaminen)
type: Concept
in scheme: conceptscheme
preferred label: lossning @sv
preferred label: unloading @en
alternative label: purku
alternative label: unpacking @en
alternative label: purkaminen
source: Kielitoimiston sanakirja
comment: tyhjentää t. siirtää pois lastia t. sisällystä jstak
broader: liikuttaminen