CE-märkning
type: Concept
scope note: CE-märke ges varor som uppfyller EU:s säkerhets- krav (bl.a. leksaker, barnvårdsprodukter, livs- medel, elprodukter, läkemedel, kemikalier). CE är förkortning av Communitas Europae.
scope note: Merkintä, jolla varustetaan EU:n turvallisuusvaatimukset täyttävät tavarat (mm. leikkikalut, lastenhoitotuotteet, elintarvikkeet, sähkötuotteet, lääkkeet, kemikaalit). Lyhenne CE tulee sanoista Communitas Europae
preferred label: ce marking @en
preferred label: CE-merkintä @fi
broader: märkning
broader: tecken
source: Lähde: Taloussanasto
related: kvalitetskontroll
related: produktsäkerhet
in scheme: conceptscheme

märkning
type: Concept
preferred label: merkintä (tieto) @fi
preferred label: marking @en
narrower: CE-märkning

tecken
type: Concept
preferred label: marks @en
preferred label: merkit @fi
narrower: CE-märkning

kvalitetskontroll
type: Concept
preferred label: quality control @en
preferred label: laadunvalvonta @fi
related: CE-märkning

produktsäkerhet
type: Concept
preferred label: product safety @en
preferred label: tuoteturvallisuus @fi
related: CE-märkning