manors
type: Concept
preferred label: herrgårdar @sv
preferred label: kartanot @fi
narrower: Kahiluoto manor

Kahiluoto manor
type: Concept
broader: manors
scope note: Kartano Seurasaaren ulkomuseossa. Kahiluodon kartano on tuotu Seurasaareen Taivassalosta Kahiluoto-nimiseltä saarelta
in scheme: conceptscheme
preferred label: Kahiluodon kartano @fi